Reaction Details
TargetCarbonic anhydrase 5B, mitochondrial
LigandBDBM50261760
Substrate/Competitorn/a
Meas. Tech.ChEMBL_514689 (CHEMBL976461)
Ki 12.9±n/a nM
Citation Poulsen, SAWilkinson, BLInnocenti, AVullo, DSupuran, CT Inhibition of human mitochondrial carbonic anhydrases VA and VB with para-(4-phenyltriazole-1-yl)-benzenesulfonamide derivatives. Bioorg Med Chem Lett18:4624-7 (2008) 
 
Carbonic anhydrase 5B, mitochondrial
Name:Carbonic anhydrase 5B, mitochondrial
Type:Enzyme
Mol. Mass.:36440.83
Organism:Homo sapiens (Human)
Description:Human (cloned) isozyme
Residue:317
BDBM50261760
NameBDBM50261760
Synonyms:4-(4-(2-(trifluoromethyl)phenyl)-1H-1,2,3-triazol-1-yl)benzenesulfonamide | CHEMBL468839
TypeSmall organic molecule
Emp. Form.C15H11F3N4O2S
Mol. Mass.368.334
SMILESNS(=O)(=O)c1ccc(cc1)-n1cc(nn1)-c1ccccc1C(F)(F)F