Reaction Details
TargetCarbonic anhydrase 5B, mitochondrial
LigandBDBM50262064
Substrate/Competitorn/a
Meas. Tech.ChEMBL_514689 (CHEMBL976461)
Ki 54.2±n/a nM
Citation Poulsen, SAWilkinson, BLInnocenti, AVullo, DSupuran, CT Inhibition of human mitochondrial carbonic anhydrases VA and VB with para-(4-phenyltriazole-1-yl)-benzenesulfonamide derivatives. Bioorg Med Chem Lett18:4624-7 (2008) 
 
Carbonic anhydrase 5B, mitochondrial
Name:Carbonic anhydrase 5B, mitochondrial
Type:Enzyme
Mol. Mass.:36440.83
Organism:Homo sapiens (Human)
Description:Human (cloned) isozyme
Residue:317
BDBM50262064
NameBDBM50262064
Synonyms:4-(4-m-tolyl-1H-1,2,3-triazol-1-yl)benzenesulfonamide | CHEMBL469221
TypeSmall organic molecule
Emp. Form.C15H14N4O2S
Mol. Mass.314.362
SMILESCc1cccc(c1)-c1cn(nn1)-c1ccc(cc1)S(N)(=O)=O