Reaction Details
TargetCarbonic anhydrase 5B, mitochondrial
LigandBDBM15222
Substrate/Competitorn/a
Meas. Tech.ChEMBL_514689 (CHEMBL976461)
Ki 55.8±n/a nM
Citation Poulsen, SAWilkinson, BLInnocenti, AVullo, DSupuran, CT Inhibition of human mitochondrial carbonic anhydrases VA and VB with para-(4-phenyltriazole-1-yl)-benzenesulfonamide derivatives. Bioorg Med Chem Lett18:4624-7 (2008) 
 
Carbonic anhydrase 5B, mitochondrial
Name:Carbonic anhydrase 5B, mitochondrial
Type:Enzyme
Mol. Mass.:36440.83
Organism:Homo sapiens (Human)
Description:Human (cloned) isozyme
Residue:317
BDBM15222
NameBDBM15222
Synonyms:4-Azidobenzenesulfonamide CHEMBL222837 | azide 1
TypeSmall organic molecule
Emp. Form.C6H6N4O2S
Mol. Mass.198.202
SMILESNS(=O)(=O)c1ccc(cc1)N=[N+]=[N-]