Reaction Details
TargetCarbonic anhydrase 1
LigandBDBM50261759
Substrate/Competitorn/a
Meas. Tech.ChEMBL_514686 (CHEMBL976458)
Ki 5800±n/a nM
Citation Poulsen, SAWilkinson, BLInnocenti, AVullo, DSupuran, CT Inhibition of human mitochondrial carbonic anhydrases VA and VB with para-(4-phenyltriazole-1-yl)-benzenesulfonamide derivatives. Bioorg Med Chem Lett18:4624-7 (2008) 
 
Carbonic anhydrase 1
Name:Carbonic anhydrase 1
Type:Enzyme
Mol. Mass.:28873.37
Organism:Homo sapiens (Human)
Description:P00915
Residue:261
BDBM50261759
NameBDBM50261759
Synonyms:4-(4-(4-methoxy-2-methylphenyl)-1H-1,2,3-triazol-1-yl)benzenesulfonamide | CHEMBL512809
TypeSmall organic molecule
Emp. Form.C16H16N4O3S
Mol. Mass.344.388
SMILESCOc1ccc(-c2cn(nn2)-c2ccc(cc2)S(N)(=O)=O)c(C)c1