Reaction Details
TargetCarbonic anhydrase 1
LigandBDBM50262066
Substrate/Competitorn/a
Meas. Tech.ChEMBL_514686 (CHEMBL976458)
Ki 100±n/a nM
Citation Poulsen, SAWilkinson, BLInnocenti, AVullo, DSupuran, CT Inhibition of human mitochondrial carbonic anhydrases VA and VB with para-(4-phenyltriazole-1-yl)-benzenesulfonamide derivatives. Bioorg Med Chem Lett18:4624-7 (2008) 
 
Carbonic anhydrase 1
Name:Carbonic anhydrase 1
Type:Enzyme
Mol. Mass.:28873.37
Organism:Homo sapiens (Human)
Description:P00915
Residue:261
BDBM50262066
NameBDBM50262066
Synonyms:4-{1-[4-(aminosulfonyl)phenyl]-1H-1,2,3-triazol-4-yl}benzenesulfonamide | CHEMBL469064
TypeSmall organic molecule
Emp. Form.C14H13N5O4S2
Mol. Mass.379.414
SMILESNS(=O)(=O)c1ccc(cc1)-c1cn(nn1)-c1ccc(cc1)S(N)(=O)=O