Reaction Details
TargetCarbonic anhydrase 1
LigandBDBM50262065
Substrate/Competitorn/a
Meas. Tech.ChEMBL_514686 (CHEMBL976458)
Ki 2200±n/a nM
Citation Poulsen, SAWilkinson, BLInnocenti, AVullo, DSupuran, CT Inhibition of human mitochondrial carbonic anhydrases VA and VB with para-(4-phenyltriazole-1-yl)-benzenesulfonamide derivatives. Bioorg Med Chem Lett18:4624-7 (2008) 
 
Carbonic anhydrase 1
Name:Carbonic anhydrase 1
Type:Enzyme
Mol. Mass.:28873.37
Organism:Homo sapiens (Human)
Description:P00915
Residue:261
BDBM50262065
NameBDBM50262065
Synonyms:4-(4-(4-methoxyphenyl)-1H-1,2,3-triazol-1-yl)benzenesulfonamide | CHEMBL513185
TypeSmall organic molecule
Emp. Form.C15H14N4O3S
Mol. Mass.330.362
SMILESCOc1ccc(cc1)-c1cn(nn1)-c1ccc(cc1)S(N)(=O)=O