Reaction Details
TargetCarbonic anhydrase 1
LigandBDBM50262062
Substrate/Competitorn/a
Meas. Tech.ChEMBL_514686 (CHEMBL976458)
Ki 5100±n/a nM
Citation Poulsen, SAWilkinson, BLInnocenti, AVullo, DSupuran, CT Inhibition of human mitochondrial carbonic anhydrases VA and VB with para-(4-phenyltriazole-1-yl)-benzenesulfonamide derivatives. Bioorg Med Chem Lett18:4624-7 (2008) 
 
Carbonic anhydrase 1
Name:Carbonic anhydrase 1
Type:Enzyme
Mol. Mass.:28873.37
Organism:Homo sapiens (Human)
Description:P00915
Residue:261
BDBM50262062
NameBDBM50262062
Synonyms:4-(4-phenyl-1H-1,2,3-triazol-1-yl)benzenesulfonamide | CHEMBL513184
TypeSmall organic molecule
Emp. Form.C14H12N4O2S
Mol. Mass.300.336
SMILESNS(=O)(=O)c1ccc(cc1)-n1cc(nn1)-c1ccccc1