Reaction Details
TargetCarbonic anhydrase 5A, mitochondrial
LigandBDBM50262062
Substrate/Competitorn/a
Meas. Tech.ChEMBL_514688 (CHEMBL976460)
Ki 17.8±n/a nM
Citation Poulsen, SAWilkinson, BLInnocenti, AVullo, DSupuran, CT Inhibition of human mitochondrial carbonic anhydrases VA and VB with para-(4-phenyltriazole-1-yl)-benzenesulfonamide derivatives. Bioorg Med Chem Lett18:4624-7 (2008) 
 
Carbonic anhydrase 5A, mitochondrial
Name:Carbonic anhydrase 5A, mitochondrial
Type:Enzyme
Mol. Mass.:34755.54
Organism:Homo sapiens (Human)
Description:Human (cloned) isozyme
Residue:305
BDBM50262062
NameBDBM50262062
Synonyms:4-(4-phenyl-1H-1,2,3-triazol-1-yl)benzenesulfonamide | CHEMBL513184
TypeSmall organic molecule
Emp. Form.C14H12N4O2S
Mol. Mass.300.336
SMILESNS(=O)(=O)c1ccc(cc1)-n1cc(nn1)-c1ccccc1