Reaction Details
TargetCannabinoid receptor 1
LigandBDBM50273033
Substrate/Competitorn/a
Meas. Tech.ChEMBL_509980 (CHEMBL1005573)
EC50 459±n/a nM
Citation Diaz, PXu, JAstruc-Diaz, FPan, HMBrown, DLNaguib, M Design and synthesis of a novel series of N-alkyl isatin acylhydrazone derivatives that act as selective cannabinoid receptor 2 agonists for the treatment of neuropathic pain. J Med Chem51:4932-47 (2008) 
 
Cannabinoid receptor 1
Name:Cannabinoid receptor 1
Type:G Protein-Coupled Receptor (GPCR)
Mol. Mass.:52868.96
Organism:Homo sapiens (Human)
Description:P21554
Residue:472
BDBM50273033
NameBDBM50273033
Synonyms:CHEMBL515205 | N'-[1-(1-Hexyl)-2-oxo-1,2-dihydro-3H-indol-3-ylidene]-2-phenylacetohydrazide
TypeSmall organic molecule
Emp. Form.C22H25N3O2
Mol. Mass.363.4528
SMILESCCCCCCN1C(=O)\C(=N/NC(=O)Cc2ccccc2)c2ccccc12