Reaction Details
TargetCannabinoid receptor 2
LigandBDBM50273100
Substrate/Competitorn/a
Meas. Tech.ChEMBL_509983 (CHEMBL1005576)
EC50 143.4±n/a nM
Citation Diaz, PXu, JAstruc-Diaz, FPan, HMBrown, DLNaguib, M Design and synthesis of a novel series of N-alkyl isatin acylhydrazone derivatives that act as selective cannabinoid receptor 2 agonists for the treatment of neuropathic pain. J Med Chem51:4932-47 (2008) 
 
Cannabinoid receptor 2
Name:Cannabinoid receptor 2
Type:G Protein-Coupled Receptor (GPCR)
Mol. Mass.:39690.94
Organism:Homo sapiens (Human)
Description:P34972
Residue:360
BDBM50273100
NameBDBM50273100
Synonyms:CHEMBL458492 | N-[(3Z)-1-Hexyl-2-oxo-1,2-dihydro-3H-indol-3-ylidene]-4-methoxybenzohydrazide
TypeSmall organic molecule
Emp. Form.C22H25N3O3
Mol. Mass.379.4522
SMILESCCCCCCN1C(=O)C(=NNC(=O)c2ccc(OC)cc2)c2ccccc12