Reaction Details
TargetCannabinoid receptor 2
LigandBDBM50272989
Substrate/Competitorn/a
Meas. Tech.ChEMBL_509991 (CHEMBL1005584)
Ki 58.8±n/a nM
Citation Diaz, PXu, JAstruc-Diaz, FPan, HMBrown, DLNaguib, M Design and synthesis of a novel series of N-alkyl isatin acylhydrazone derivatives that act as selective cannabinoid receptor 2 agonists for the treatment of neuropathic pain. J Med Chem51:4932-47 (2008) 
 
Cannabinoid receptor 2
Name:Cannabinoid receptor 2
Type:G Protein-Coupled Receptor (GPCR)
Mol. Mass.:39690.94
Organism:Homo sapiens (Human)
Description:P34972
Residue:360
BDBM50272989
NameBDBM50272989
Synonyms:CHEMBL514406 | N'-[(3Z)-1-(2-Cyclohexylethyl)-2-oxo-1,2-dihydro-3H-indol-3-ylidene]benzohydrazide
TypeSmall organic molecule
Emp. Form.C23H25N3O2
Mol. Mass.375.4635
SMILESO=C(N\N=C1/C(=O)N(CCC2CCCCC2)c2ccccc12)c1ccccc1