Reaction Details
TargetCorticotropin-releasing factor receptor 1
LigandBDBM29442
Substrate/Competitorn/a
Meas. Tech.ChEMBL_510097 (CHEMBL998751)
Ki 2±n/a nM
Citation Yoon, TDe Lombaert, SBrodbeck, RGulianello, MKrause, JEHutchison, AHorvath, RFGe, PKehne, JHoffman, DChandrasekhar, JDoller, DHodgetts, KJ 2-Arylpyrimidines: novel CRF-1 receptor antagonists. Bioorg Med Chem Lett18:4486-90 (2008) 
 
Corticotropin-releasing factor receptor 1
Name:Corticotropin-releasing factor receptor 1
Type:Enzyme
Mol. Mass.:50744.31
Organism:Homo sapiens (Human)
Description:P34998
Residue:444
BDBM29442
NameBDBM29442
Synonyms:CHEMBL524616 | Pyrazolo[1,5-a]-1,3,5-triazine, 12-11
TypeSmall organic molecule
Emp. Form.C20H27N5O3
Mol. Mass.385.4601
SMILESCOCC(COC)Nc1nc(C)nc2c(c(C)nn12)-c1ccc(OC)cc1C