Reaction Details
TargetTrifunctional purine biosynthetic protein adenosine-3
LigandBDBM50272231
Substrate/Competitorn/a
Meas. Tech.ChEMBL_510466 (CHEMBL1006407)
IC50>20000±n/a nM
Citation Deng, YWang, YCherian, CHou, ZBuck, SAMatherly, LHGangjee, A Synthesis and discovery of high affinity folate receptor-specific glycinamide ribonucleotide formyltransferase inhibitors with antitumor activity. J Med Chem51:5052-63 (2008) 
 
Trifunctional purine biosynthetic protein adenosine-3
Name:Trifunctional purine biosynthetic protein adenosine-3
Type:PROTEIN
Mol. Mass.:107504.27
Organism:Mus musculus
Description:ChEMBL_497843
Residue:1010
BDBM50272231
NameBDBM50272231
Synonyms:(S)-2-(4-((2-amino-4-oxo-4,7-dihydro-3H-pyrrolo[2,3-d]pyrimidin-6-yl)methyl)benzamido)pentanedioic acid | CHEMBL498800
TypeSmall organic molecule
Emp. Form.C19H19N5O6
Mol. Mass.413.3841
SMILESNc1nc2[nH]c(Cc3ccc(cc3)C(=O)N[C@@H](CCC(O)=O)C(O)=O)cc2c(=O)[nH]1