Reaction Details
TargetTrifunctional purine biosynthetic protein adenosine-3
LigandBDBM50171511
Substrate/Competitorn/a
Meas. Tech.ChEMBL_510466 (CHEMBL1006407)
IC50 150±n/a nM
Citation Deng, YWang, YCherian, CHou, ZBuck, SAMatherly, LHGangjee, A Synthesis and discovery of high affinity folate receptor-specific glycinamide ribonucleotide formyltransferase inhibitors with antitumor activity. J Med Chem51:5052-63 (2008) 
 
Trifunctional purine biosynthetic protein adenosine-3
Name:Trifunctional purine biosynthetic protein adenosine-3
Type:PROTEIN
Mol. Mass.:107504.27
Organism:Mus musculus
Description:ChEMBL_497843
Residue:1010
BDBM50171511
NameBDBM50171511
Synonyms:(S)-2-(4-(4-(2-amino-4-oxo-4,7-dihydro-3H-pyrrolo[2,3-d]pyrimidin-6-yl)butyl)benzamido)pentanedioic acid CHEMBL365307 | N-{4-[4-(2-Amino-4-oxo-4,7-dihydro-3H-pyrrolo[2,3-d]pyrimidin-6-yl)butyl]benzoyl}-L-glutamic Acid
TypeSmall organic molecule
Emp. Form.C22H25N5O6
Mol. Mass.455.4638
SMILESNc1nc2[nH]c(CCCCc3ccc(cc3)C(=O)N[C@@H](CCC(O)=O)C(O)=O)cc2c(=O)[nH]1