Reaction Details
TargetCannabinoid receptor 1
LigandBDBM50272508
Substrate/Competitorn/a
Meas. Tech.ChEMBL_510470 (CHEMBL1006411)
Ki 6.1±n/a nM
Citation Pasquini, SBotta, LSemeraro, TMugnaini, CLigresti, APalazzo, EMaione, SDi Marzo, VCorelli, F Investigations on the 4-quinolone-3-carboxylic acid motif. 2. Synthesis and structure-activity relationship of potent and selective cannabinoid-2 receptor agonists endowed with analgesic activity in vivo. J Med Chem51:5075-84 (2008) 
 
Cannabinoid receptor 1
Name:Cannabinoid receptor 1
Type:G Protein-Coupled Receptor (GPCR)
Mol. Mass.:52868.96
Organism:Homo sapiens (Human)
Description:P21554
Residue:472
BDBM50272508
NameBDBM50272508
Synonyms:CHEMBL507019 | N-(Adamant-1-yl)-4-oxo-1-pentyl-7-(phenylsulfonyl)-1,4-dihydroquinoline-3-carboxamide
TypeSmall organic molecule
Emp. Form.C31H36N2O4S
Mol. Mass.532.694
SMILESCCCCCn1cc(C(=O)NC23CC4CC(CC(C4)C2)C3)c(=O)c2ccc(cc12)S(=O)(=O)c1ccccc1