Reaction Details
TargetCannabinoid receptor 2
LigandBDBM50272546
Substrate/Competitorn/a
Meas. Tech.ChEMBL_510471 (CHEMBL1006412)
Ki 55.9±n/a nM
Citation Pasquini, SBotta, LSemeraro, TMugnaini, CLigresti, APalazzo, EMaione, SDi Marzo, VCorelli, F Investigations on the 4-quinolone-3-carboxylic acid motif. 2. Synthesis and structure-activity relationship of potent and selective cannabinoid-2 receptor agonists endowed with analgesic activity in vivo. J Med Chem51:5075-84 (2008) 
 
Cannabinoid receptor 2
Name:Cannabinoid receptor 2
Type:G Protein-Coupled Receptor (GPCR)
Mol. Mass.:39690.94
Organism:Homo sapiens (Human)
Description:P34972
Residue:360
BDBM50272546
NameBDBM50272546
Synonyms:(E)-N-(Adamant-1-yl)-6-[2-(4-methoxyphenyl)vinyl]-4-oxo-1-pentyl-1,4-dihydroquinoline-3-carboxamide | CHEMBL524731
TypeSmall organic molecule
Emp. Form.C34H40N2O3
Mol. Mass.524.693
SMILESCCCCCn1cc(C(=O)NC23CC4CC(CC(C4)C2)C3)c(=O)c2cc(\C=C\c3ccc(OC)cc3)ccc12