Reaction Details
TargetCannabinoid receptor 1
LigandBDBM50272485
Substrate/Competitorn/a
Meas. Tech.ChEMBL_510470 (CHEMBL1006411)
Ki 29.7±n/a nM
Citation Pasquini, SBotta, LSemeraro, TMugnaini, CLigresti, APalazzo, EMaione, SDi Marzo, VCorelli, F Investigations on the 4-quinolone-3-carboxylic acid motif. 2. Synthesis and structure-activity relationship of potent and selective cannabinoid-2 receptor agonists endowed with analgesic activity in vivo. J Med Chem51:5075-84 (2008) 
 
Cannabinoid receptor 1
Name:Cannabinoid receptor 1
Type:G Protein-Coupled Receptor (GPCR)
Mol. Mass.:52868.96
Organism:Homo sapiens (Human)
Description:P21554
Residue:472
BDBM50272485
NameBDBM50272485
Synonyms:(R)-7-Ethoxy-4-oxo-1-pentyl-N-(1-phenylethyl)-1,4-dihydroquinoline-3-carboxamide | CHEMBL497681
TypeSmall organic molecule
Emp. Form.C25H30N2O3
Mol. Mass.406.5173
SMILESCCCCCn1cc(C(=O)N[C@H](C)c2ccccc2)c(=O)c2ccc(OCC)cc12