Reaction Details
TargetCannabinoid receptor 1
LigandBDBM50272235
Substrate/Competitorn/a
Meas. Tech.ChEMBL_510483 (CHEMBL1006424)
EC50>1000±n/a nM
Citation Cheng, YAlbrecht, BKBrown, JBuchanan, JLBuckner, WHDiMauro, EFEmkey, RFremeau, RTHarmange, JCHoffman, BJHuang, LHuang, MLee, JHLin, FFMartin, MWNguyen, HQPatel, VFTomlinson, SAWhite, RDXia, XHitchcock, SA Discovery and optimization of a novel series of N-arylamide oxadiazoles as potent, highly selective and orally bioavailable cannabinoid receptor 2 (CB2) agonists. J Med Chem51:5019-34 (2008) 
 
Cannabinoid receptor 1
Name:Cannabinoid receptor 1
Type:G Protein-Coupled Receptor (GPCR)
Mol. Mass.:52856.55
Organism:Rattus norvegicus (rat)
Description:P20272
Residue:473
BDBM50272235
NameBDBM50272235
Synonyms:3-(3-(3-Cyanopyridin-4-yl)-1,2,4-oxadiazol-5-yl)-N-(9-ethyl-9Hcarbazol-3-yl)propanamide | CHEMBL499601
TypeSmall organic molecule
Emp. Form.C25H20N6O2
Mol. Mass.436.4653
SMILESCCn1c2ccccc2c2cc(NC(=O)CCc3nc(no3)-c3ccncc3C#N)ccc12