Reaction Details
TargetCannabinoid receptor 1
LigandBDBM50272313
Substrate/Competitorn/a
Meas. Tech.ChEMBL_510483 (CHEMBL1006424)
EC50>1000±n/a nM
Citation Cheng, YAlbrecht, BKBrown, JBuchanan, JLBuckner, WHDiMauro, EFEmkey, RFremeau, RTHarmange, JCHoffman, BJHuang, LHuang, MLee, JHLin, FFMartin, MWNguyen, HQPatel, VFTomlinson, SAWhite, RDXia, XHitchcock, SA Discovery and optimization of a novel series of N-arylamide oxadiazoles as potent, highly selective and orally bioavailable cannabinoid receptor 2 (CB2) agonists. J Med Chem51:5019-34 (2008) 
 
Cannabinoid receptor 1
Name:Cannabinoid receptor 1
Type:G Protein-Coupled Receptor (GPCR)
Mol. Mass.:52856.55
Organism:Rattus norvegicus (rat)
Description:P20272
Residue:473
BDBM50272313
NameBDBM50272313
Synonyms:3-(3-(2-Chloro-4-fluorophenyl)-1,2,4-oxadiazol-5-yl)-N-(4-(trifluoromethyl)phenyl)propanamide | CHEMBL500133
TypeSmall organic molecule
Emp. Form.C18H12ClF4N3O2
Mol. Mass.413.753
SMILESFc1ccc(-c2noc(CCC(=O)Nc3ccc(cc3)C(F)(F)F)n2)c(Cl)c1