Reaction Details
TargetCannabinoid receptor 1
LigandBDBM50272277
Substrate/Competitorn/a
Meas. Tech.ChEMBL_510479 (CHEMBL1006420)
EC50>1000±n/a nM
Citation Cheng, YAlbrecht, BKBrown, JBuchanan, JLBuckner, WHDiMauro, EFEmkey, RFremeau, RTHarmange, JCHoffman, BJHuang, LHuang, MLee, JHLin, FFMartin, MWNguyen, HQPatel, VFTomlinson, SAWhite, RDXia, XHitchcock, SA Discovery and optimization of a novel series of N-arylamide oxadiazoles as potent, highly selective and orally bioavailable cannabinoid receptor 2 (CB2) agonists. J Med Chem51:5019-34 (2008) 
 
Cannabinoid receptor 1
Name:Cannabinoid receptor 1
Type:G Protein-Coupled Receptor (GPCR)
Mol. Mass.:52868.96
Organism:Homo sapiens (Human)
Description:P21554
Residue:472
BDBM50272277
NameBDBM50272277
Synonyms:3-(3-(2-Chloro-4-fluorophenyl)-1,2,4-oxadiazol-5-yl)-N-(6-(trifluoromethoxy)benzo[d]thiazol-2-yl)propanamide | CHEMBL499328
TypeSmall organic molecule
Emp. Form.C19H11ClF4N4O3S
Mol. Mass.486.827
SMILESFc1ccc(-c2noc(CCC(=O)Nc3nc4ccc(OC(F)(F)F)cc4s3)n2)c(Cl)c1