Reaction Details
TargetCannabinoid receptor 1
LigandBDBM50272232
Substrate/Competitorn/a
Meas. Tech.ChEMBL_510479 (CHEMBL1006420)
EC50>1000±n/a nM
Citation Cheng, YAlbrecht, BKBrown, JBuchanan, JLBuckner, WHDiMauro, EFEmkey, RFremeau, RTHarmange, JCHoffman, BJHuang, LHuang, MLee, JHLin, FFMartin, MWNguyen, HQPatel, VFTomlinson, SAWhite, RDXia, XHitchcock, SA Discovery and optimization of a novel series of N-arylamide oxadiazoles as potent, highly selective and orally bioavailable cannabinoid receptor 2 (CB2) agonists. J Med Chem51:5019-34 (2008) 
 
Cannabinoid receptor 1
Name:Cannabinoid receptor 1
Type:G Protein-Coupled Receptor (GPCR)
Mol. Mass.:52868.96
Organism:Homo sapiens (Human)
Description:P21554
Residue:472
BDBM50272232
NameBDBM50272232
Synonyms:3-(3-(2-Chloro-4-fluorophenyl)-1,2,4-oxadiazol-5-yl)-N-(9-ethyl-9H-carbazol-3-yl)propanamide | CHEMBL527095
TypeSmall organic molecule
Emp. Form.C25H20ClFN4O2
Mol. Mass.462.903
SMILESCCn1c2ccccc2c2cc(NC(=O)CCc3nc(no3)-c3ccc(F)cc3Cl)ccc12