Reaction Details
TargetCannabinoid receptor 2
LigandBDBM50272347
Substrate/Competitorn/a
Meas. Tech.ChEMBL_510480 (CHEMBL1006421)
EC50 360±n/a nM
Citation Cheng, YAlbrecht, BKBrown, JBuchanan, JLBuckner, WHDiMauro, EFEmkey, RFremeau, RTHarmange, JCHoffman, BJHuang, LHuang, MLee, JHLin, FFMartin, MWNguyen, HQPatel, VFTomlinson, SAWhite, RDXia, XHitchcock, SA Discovery and optimization of a novel series of N-arylamide oxadiazoles as potent, highly selective and orally bioavailable cannabinoid receptor 2 (CB2) agonists. J Med Chem51:5019-34 (2008) 
 
Cannabinoid receptor 2
Name:Cannabinoid receptor 2
Type:G Protein-Coupled Receptor (GPCR)
Mol. Mass.:39690.94
Organism:Homo sapiens (Human)
Description:P34972
Residue:360
BDBM50272347
NameBDBM50272347
Synonyms:5-(3-(3-(2-Chloro-4-fluorophenyl)-1,2,4-oxadiazol-5-yl)propylamino)-2-(2,2,2-trifluoroethoxy)nicotinonitrile | CHEMBL524839
TypeSmall organic molecule
Emp. Form.C19H14ClF4N5O2
Mol. Mass.455.793
SMILESFc1ccc(-c2noc(CCCNc3cnc(OCC(F)(F)F)c(c3)C#N)n2)c(Cl)c1