Reaction Details
TargetCannabinoid receptor 1
LigandBDBM50272275
Substrate/Competitorn/a
Meas. Tech.ChEMBL_510475 (CHEMBL1006416)
EC50 0.9±n/a nM
Citation Cheng, YAlbrecht, BKBrown, JBuchanan, JLBuckner, WHDiMauro, EFEmkey, RFremeau, RTHarmange, JCHoffman, BJHuang, LHuang, MLee, JHLin, FFMartin, MWNguyen, HQPatel, VFTomlinson, SAWhite, RDXia, XHitchcock, SA Discovery and optimization of a novel series of N-arylamide oxadiazoles as potent, highly selective and orally bioavailable cannabinoid receptor 2 (CB2) agonists. J Med Chem51:5019-34 (2008) 
 
Cannabinoid receptor 1
Name:Cannabinoid receptor 1
Type:G Protein-Coupled Receptor (GPCR)
Mol. Mass.:52868.96
Organism:Homo sapiens (Human)
Description:P21554
Residue:472
BDBM50272275
NameBDBM50272275
Synonyms:3-(3-(2-Chloro-4-fluorophenyl)-1,2,4-oxadiazol-5-yl)-N-(6-chloroquinolin-3-yl)propanamide | CHEMBL526345
TypeSmall organic molecule
Emp. Form.C20H13Cl2FN4O2
Mol. Mass.431.247
SMILESFc1ccc(-c2noc(CCC(=O)Nc3cnc4ccc(Cl)cc4c3)n2)c(Cl)c1