Reaction Details
TargetCannabinoid receptor 1
LigandBDBM50272600
Substrate/Competitorn/a
Meas. Tech.ChEMBL_510475 (CHEMBL1006416)
EC50>10000±n/a nM
Citation Cheng, YAlbrecht, BKBrown, JBuchanan, JLBuckner, WHDiMauro, EFEmkey, RFremeau, RTHarmange, JCHoffman, BJHuang, LHuang, MLee, JHLin, FFMartin, MWNguyen, HQPatel, VFTomlinson, SAWhite, RDXia, XHitchcock, SA Discovery and optimization of a novel series of N-arylamide oxadiazoles as potent, highly selective and orally bioavailable cannabinoid receptor 2 (CB2) agonists. J Med Chem51:5019-34 (2008) 
 
Cannabinoid receptor 1
Name:Cannabinoid receptor 1
Type:G Protein-Coupled Receptor (GPCR)
Mol. Mass.:52868.96
Organism:Homo sapiens (Human)
Description:P21554
Residue:472
BDBM50272600
NameBDBM50272600
Synonyms:CHEMBL498323 | N-(9-Ethyl-9H-carbazol-3-yl)-3-(3-(2-fluorophenyl)isoxazol-5-yl)propanamide
TypeSmall organic molecule
Emp. Form.C26H22FN3O2
Mol. Mass.427.4702
SMILESCCn1c2ccccc2c2cc(NC(=O)CCc3nc(co3)-c3ccccc3F)ccc12