Reaction Details
TargetCannabinoid receptor 2
LigandBDBM50272392
Substrate/Competitorn/a
Meas. Tech.ChEMBL_510476 (CHEMBL1006417)
EC50 27±n/a nM
Citation Cheng, YAlbrecht, BKBrown, JBuchanan, JLBuckner, WHDiMauro, EFEmkey, RFremeau, RTHarmange, JCHoffman, BJHuang, LHuang, MLee, JHLin, FFMartin, MWNguyen, HQPatel, VFTomlinson, SAWhite, RDXia, XHitchcock, SA Discovery and optimization of a novel series of N-arylamide oxadiazoles as potent, highly selective and orally bioavailable cannabinoid receptor 2 (CB2) agonists. J Med Chem51:5019-34 (2008) 
 
Cannabinoid receptor 2
Name:Cannabinoid receptor 2
Type:G Protein-Coupled Receptor (GPCR)
Mol. Mass.:39690.94
Organism:Homo sapiens (Human)
Description:P34972
Residue:360
BDBM50272392
NameBDBM50272392
Synonyms:5-tert-Butyl-N-(3-(3-(2-chloro-4-fluorophenyl)-1,2,4-oxadiazol-5-yl)propyl)isoxazol-3-amine | CHEMBL500670
TypeSmall organic molecule
Emp. Form.C18H20ClFN4O2
Mol. Mass.378.828
SMILESCC(C)(C)c1cc(NCCCc2nc(no2)-c2ccc(F)cc2Cl)no1