Reaction Details
TargetCannabinoid receptor 2
LigandBDBM50272315
Substrate/Competitorn/a
Meas. Tech.ChEMBL_510476 (CHEMBL1006417)
EC50 62±n/a nM
Citation Cheng, YAlbrecht, BKBrown, JBuchanan, JLBuckner, WHDiMauro, EFEmkey, RFremeau, RTHarmange, JCHoffman, BJHuang, LHuang, MLee, JHLin, FFMartin, MWNguyen, HQPatel, VFTomlinson, SAWhite, RDXia, XHitchcock, SA Discovery and optimization of a novel series of N-arylamide oxadiazoles as potent, highly selective and orally bioavailable cannabinoid receptor 2 (CB2) agonists. J Med Chem51:5019-34 (2008) 
 
Cannabinoid receptor 2
Name:Cannabinoid receptor 2
Type:G Protein-Coupled Receptor (GPCR)
Mol. Mass.:39690.94
Organism:Homo sapiens (Human)
Description:P34972
Residue:360
BDBM50272315
NameBDBM50272315
Synonyms:CHEMBL524680 | N-(3-Chloro-4-(trifluoromethyl)phenyl)-3-(3-(2-chloro-4-fluo-rophenyl)-1,2,4-oxadiazol-5-yl)propanamide
TypeSmall organic molecule
Emp. Form.C18H11Cl2F4N3O2
Mol. Mass.448.198
SMILESFc1ccc(-c2noc(CCC(=O)Nc3ccc(c(Cl)c3)C(F)(F)F)n2)c(Cl)c1