Reaction Details
TargetCannabinoid receptor 2
LigandBDBM50272233
Substrate/Competitorn/a
Meas. Tech.ChEMBL_510476 (CHEMBL1006417)
EC50 0.089±n/a nM
Citation Cheng, YAlbrecht, BKBrown, JBuchanan, JLBuckner, WHDiMauro, EFEmkey, RFremeau, RTHarmange, JCHoffman, BJHuang, LHuang, MLee, JHLin, FFMartin, MWNguyen, HQPatel, VFTomlinson, SAWhite, RDXia, XHitchcock, SA Discovery and optimization of a novel series of N-arylamide oxadiazoles as potent, highly selective and orally bioavailable cannabinoid receptor 2 (CB2) agonists. J Med Chem51:5019-34 (2008) 
 
Cannabinoid receptor 2
Name:Cannabinoid receptor 2
Type:G Protein-Coupled Receptor (GPCR)
Mol. Mass.:39690.94
Organism:Homo sapiens (Human)
Description:P34972
Residue:360
BDBM50272233
NameBDBM50272233
Synonyms:CHEMBL501472 | N-(9-Ethyl-9H-carbazol-3-yl)-3-(3-(4-fluoro-2-methylphenyl)-1,2,4-oxadiazol-5-yl)propanamide
TypeSmall organic molecule
Emp. Form.C26H23FN4O2
Mol. Mass.442.4848
SMILESCCn1c2ccccc2c2cc(NC(=O)CCc3nc(no3)-c3ccc(F)cc3C)ccc12