Reaction Details
TargetCytochrome P450 2C9
LigandBDBM50174022
Substrate/Competitorn/a
Meas. Tech.ChEMBL_511381 (CHEMBL1007305)
IC50 200±n/a nM
Citation Kodimuthali, AJabaris, SSPal, M Recent advances on phosphodiesterase 4 inhibitors for the treatment of asthma and chronic obstructive pulmonary disease. J Med Chem51:5471-89 (2008) 
 
Cytochrome P450 2C9
Name:Cytochrome P450 2C9
Type:Enzyme
Mol. Mass.:55636.33
Organism:Homo sapiens (Human)
Description:P11712
Residue:490
BDBM50174022
NameBDBM50174022
Synonyms:(E)-8-(3-(2-(3-methyl-1,2,4-oxadiazol-5-yl)-2-(4-(methylsulfonyl)phenyl)vinyl)phenyl)-6-(2-(methylsulfonyl)propan-2-yl)quinoline 8-(3-methoxyphenyl)-6-(pyridin-4-ylmethyl)quinoline L-454560
TypeSmall organic molecule
Emp. Form.C31H29N3O5S2
Mol. Mass.587.709
SMILESCc1noc(n1)C(=C\c1cccc(c1)-c1cc(cc2cccnc12)C(C)(C)S(C)(=O)=O)\c1ccc(cc1)S(C)(=O)=O