Reaction Details
TargetSalicyl-AMP ligase / salicyl-S-ArCP synthetase
LigandBDBM50244934
Substrate/Competitorn/a
Meas. Tech.ChEMBL_511444 (CHEMBL1003925)
Ki 0.27±n/a nM
Citation Neres, JLabello, NPSomu, RVBoshoff, HIWilson, DJVannada, JChen, LBarry, CEBennett, EMAldrich, CC Inhibition of siderophore biosynthesis in Mycobacterium tuberculosis with nucleoside bisubstrate analogues: structure-activity relationships of the nucleobase domain of 5'-O-[N-(salicyl)sulfamoyl]adenosine. J Med Chem51:5349-70 (2008) 
 
Salicyl-AMP ligase / salicyl-S-ArCP synthetase
Name:Salicyl-AMP ligase / salicyl-S-ArCP synthetase
Type:PROTEIN
Mol. Mass.:59275.32
Organism:Mycobacterium tuberculosis
Description:ChEMBL_423930
Residue:565
BDBM50244934
NameBDBM50244934
Synonyms:5'-O-[N-(2-Hydroxybenzoyl)sulfamoyl]-2-phenyladenosine TriethylammoniumSalt
TypeSmall organic molecule
Emp. Form.C23H21N6O8S
Mol. Mass.541.514
SMILESNc1nc(nc2n(cnc12)[C@@H]1O[C@H](COS(=O)(=O)[N-]C(=O)c2ccccc2O)[C@@H](O)[C@H]1O)-c1ccccc1