Reaction Details
Target17-beta-hydroxysteroid dehydrogenase type 2
LigandBDBM23419
Substrate/Competitorn/a
Meas. Tech.ChEMBL_555026 (CHEMBL958789)
IC50 14400±n/a nM
Citation Schuster, DNashev, LGKirchmair, JLaggner, CWolber, GLanger, TOdermatt, A Discovery of nonsteroidal 17beta-hydroxysteroid dehydrogenase 1 inhibitors by pharmacophore-based screening of virtual compound libraries. J Med Chem51:4188-99 (2008) 
 
17-beta-hydroxysteroid dehydrogenase type 2
Name:17-beta-hydroxysteroid dehydrogenase type 2
Type:Oxidoreductase; single-pass type II membrane protein
Mol. Mass.:42795.29
Organism:Homo sapiens (Human)
Description:Enzyme was partially purified from human placenta.
Residue:387
BDBM23419
NameBDBM23419
Synonyms:(2S)-5,7-dihydroxy-2-(4-hydroxyphenyl)-3,4-dihydro-2H-1-benzopyran-4-one Naringenin
Typeflavanone
Emp. Form.C15H12O5
Mol. Mass.272.2528
SMILESOc1ccc(cc1)[C@@H]1CC(=O)c2c(O)cc(O)cc2O1