Reaction Details
TargetFatty acid-binding protein, liver
LigandBDBM25766
Substrate/Competitorn/a
Meas. Tech.ChEMBL_555395 (CHEMBL964792)
Ki 2310000±n/a nM
Citation Chuang, SVelkov, THorne, JPorter, CJScanlon, MJ Characterization of the drug binding specificity of rat liver fatty acid binding protein. J Med Chem51:3755-64 (2008) 
 
Fatty acid-binding protein, liver
Name:Fatty acid-binding protein, liver
Type:Protein
Mol. Mass.:14274.39
Organism:Rattus norvegicus (Rat)
Description:rat L-FABP
Residue:127
BDBM25766
NameBDBM25766
Synonyms:(2R,3S)-5-[3-(tert-butylamino)-2-hydroxypropoxy]-1,2,3,4-tetrahydronaphthalene-2,3-diol Corgard Solgol | cid_39147
TypeSmall organic molecule
Emp. Form.C17H27NO4
Mol. Mass.309.4006
SMILESCC(C)(C)NCC(O)COc1cccc2C[C@@H](O)[C@@H](O)Cc12