Reaction Details
TargetFatty acid-binding protein, liver
LigandBDBM25753
Substrate/Competitorn/a
Meas. Tech.ChEMBL_555395 (CHEMBL964792)
Ki 717000±n/a nM
Citation Chuang, SVelkov, THorne, JPorter, CJScanlon, MJ Characterization of the drug binding specificity of rat liver fatty acid binding protein. J Med Chem51:3755-64 (2008) 
 
Fatty acid-binding protein, liver
Name:Fatty acid-binding protein, liver
Type:Protein
Mol. Mass.:14274.39
Organism:Rattus norvegicus (Rat)
Description:rat L-FABP
Residue:127
BDBM25753
NameBDBM25753
Synonyms:2-{4-[2-hydroxy-3-(propan-2-ylamino)propoxy]phenyl}acetamide Atenolol Tenormin | Tenormine
TypeSmall organic molecule
Emp. Form.C14H22N2O3
Mol. Mass.266.3361
SMILESCC(C)NCC(O)COc1ccc(CC(N)=O)cc1