Reaction Details
TargetFatty acid-binding protein, liver
LigandBDBM50150484
Substrate/Competitorn/a
Meas. Tech.ChEMBL_555398 (CHEMBL964795)
Ki 2900±n/a nM
Citation Chuang, SVelkov, THorne, JPorter, CJScanlon, MJ Characterization of the drug binding specificity of rat liver fatty acid binding protein. J Med Chem51:3755-64 (2008) 
 
Fatty acid-binding protein, liver
Name:Fatty acid-binding protein, liver
Type:Protein
Mol. Mass.:14274.39
Organism:Rattus norvegicus (Rat)
Description:rat L-FABP
Residue:127
BDBM50150484
NameBDBM50150484
Synonyms:(Z)-9-octadecenoic acid CHEMBL8659 Octadec-9-enoic acid oleicacid
TypeSmall organic molecule
Emp. Form.C18H34O2
Mol. Mass.282.4614
SMILESCCCCCCCC\C=C/CCCCCCCC(O)=O