Reaction Details
TargetFatty acid-binding protein, liver
LigandBDBM50233673
Substrate/Competitorn/a
Meas. Tech.ChEMBL_555398 (CHEMBL964795)
Ki 161000±n/a nM
Citation Chuang, SVelkov, THorne, JPorter, CJScanlon, MJ Characterization of the drug binding specificity of rat liver fatty acid binding protein. J Med Chem51:3755-64 (2008) 
 
Fatty acid-binding protein, liver
Name:Fatty acid-binding protein, liver
Type:Protein
Mol. Mass.:14274.39
Organism:Rattus norvegicus (Rat)
Description:rat L-FABP
Residue:127
BDBM50233673
NameBDBM50233673
Synonyms:(+)-2-(4-(1-oxoisoindolin-2-yl)phenyl)propanoic acid 2-[4-(1-Oxo-1,3-dihydro-isoindol-2-yl)-phenyl]-propionic acid INDOPROFEN | cid_3718
TypeSmall organic molecule
Emp. Form.C17H15NO3
Mol. Mass.281.3059
SMILESCC(C(O)=O)c1ccc(cc1)N1Cc2ccccc2C1=O