Reaction Details
TargetGamma-aminobutyric acid receptor subunit alpha-1
LigandBDBM50244195
Substrate/Competitorn/a
Meas. Tech.ChEMBL_491431 (CHEMBL948526)
Ki 6.8±n/a nM
Citation Harris, DClayton, TCook, JSahbaie, PHalliwell, RFFurtmüller, RHuck, SSieghart, WDeLorey, TM Selective influence on contextual memory: physiochemical properties associated with selectivity of benzodiazepine ligands at GABAA receptors containing the alpha5 subunit. J Med Chem51:3788-803 (2008) 
 
Gamma-aminobutyric acid receptor subunit alpha-1
Name:Gamma-aminobutyric acid receptor subunit alpha-1
Type:Protein
Mol. Mass.:51817.35
Organism:Homo sapiens (Human)
Description:P14867
Residue:456
BDBM50244195
NameBDBM50244195
Synonyms:CHEMBL453251 | ethyl 7-chloro-4-methyl-5-oxo-4,5-dihydroimidazo[1,5-a]quinazoline-3-carboxylate
TypeSmall organic molecule
Emp. Form.C14H12ClN3O3
Mol. Mass.305.716
SMILESCCOC(=O)c1ncn2c1n(C)c(=O)c1cc(Cl)ccc21