Reaction Details
TargetGamma-aminobutyric acid receptor subunit alpha-5
LigandBDBM50244228
Substrate/Competitorn/a
Meas. Tech.ChEMBL_491119 (CHEMBL991887)
Ki 9.8±n/a nM
Citation Harris, DClayton, TCook, JSahbaie, PHalliwell, RFFurtmüller, RHuck, SSieghart, WDeLorey, TM Selective influence on contextual memory: physiochemical properties associated with selectivity of benzodiazepine ligands at GABAA receptors containing the alpha5 subunit. J Med Chem51:3788-803 (2008) 
 
Gamma-aminobutyric acid receptor subunit alpha-5
Name:Gamma-aminobutyric acid receptor subunit alpha-5
Type:Enzyme
Mol. Mass.:52160.59
Organism:Homo sapiens (Human)
Description:P31644
Residue:462
BDBM50244228
NameBDBM50244228
Synonyms:CHEMBL458319 | cyclopropylmethyl 7-chloro-4-methyl-5-oxo-4,5-dihydroimidazo[1,5-a]quinazoline-3-carboxylate
TypeSmall organic molecule
Emp. Form.C16H14ClN3O3
Mol. Mass.331.754
SMILESCn1c2c(ncn2c2ccc(Cl)cc2c1=O)C(=O)OCC1CC1