Reaction Details
Target11-beta-hydroxysteroid dehydrogenase 1
LigandBDBM50243632
Substrate/Competitorn/a
Meas. Tech.ChEMBL_487342 (CHEMBL1021868)
IC50 0.8±n/a nM
Citation Julian, LDWang, ZBostick, TCaille, SChoi, RDeGraffenreid, MDi, YHe, XHungate, RWJaen, JCLiu, JMonshouwer, MMcMinn, DRew, YSudom, ASun, DTu, HUrsu, SWalker, NYan, XYe, QPowers, JP Discovery of novel, potent benzamide inhibitors of 11beta-hydroxysteroid dehydrogenase type 1 (11beta-HSD1) exhibiting oral activity in an enzyme inhibition ex vivo model. J Med Chem51:3953-60 (2008) 
 
11-beta-hydroxysteroid dehydrogenase 1
Name:11-beta-hydroxysteroid dehydrogenase 1
Type:Enzyme
Mol. Mass.:32409.16
Organism:Homo sapiens (Human)
Description:P28845
Residue:292
BDBM50243632
NameBDBM50243632
Synonyms:(S)-N-Cyclohexyl-4-(1,1,1-trifluoro-2-hydroxypropan-2-yl)-N-cyclopropylbenzamide | CHEMBL469698
TypeSmall organic molecule
Emp. Form.C19H24F3NO2
Mol. Mass.355.3946
SMILESC[C@](O)(c1ccc(cc1)C(=O)N(C1CC1)C1CCCCC1)C(F)(F)F