Reaction Details
TargetPotassium voltage-gated channel subfamily H member 2
LigandBDBM50243345
Substrate/Competitorn/a
Meas. Tech.ChEMBL_487380 (CHEMBL1021907)
IC50>30000±n/a nM
Citation Su, DSLim, JLTinney, EWan, BLMurphy, KLReiss, DRHarrell, CMO'Malley, SSRansom, RWChang, RSPettibone, DJYu, JTang, CPrueksaritanont, TFreidinger, RMBock, MGAnthony, NJ 2-Aminobenzophenones as a novel class of bradykinin B1 receptor antagonists. J Med Chem51:3946-52 (2008) 
 
Potassium voltage-gated channel subfamily H member 2
Name:Potassium voltage-gated channel subfamily H member 2
Type:Multi-pass membrane protein
Mol. Mass.:126672.65
Organism:Homo sapiens (Human)
Description:Q12809
Residue:1159
BDBM50243345
NameBDBM50243345
Synonyms:CHEMBL451761 | Tetrahydrofuran-2-ylmethyl{4-[({2-[(5-fluoropyridin-2-yl)carbonyl]phenyl}amino)sulfonyl]phenyl}carbamate
TypeSmall organic molecule
Emp. Form.C24H22FN3O6S
Mol. Mass.499.511
SMILESFc1ccc(nc1)C(=O)c1ccccc1NS(=O)(=O)c1ccc(NC(=O)OCC2CCCO2)cc1