Reaction Details
TargetB1 bradykinin receptor
LigandBDBM50243065
Substrate/Competitorn/a
Meas. Tech.ChEMBL_487377 (CHEMBL1021904)
Ki 56±n/a nM
Citation Su, DSLim, JLTinney, EWan, BLMurphy, KLReiss, DRHarrell, CMO'Malley, SSRansom, RWChang, RSPettibone, DJYu, JTang, CPrueksaritanont, TFreidinger, RMBock, MGAnthony, NJ 2-Aminobenzophenones as a novel class of bradykinin B1 receptor antagonists. J Med Chem51:3946-52 (2008) 
 
B1 bradykinin receptor
Name:B1 bradykinin receptor
Type:Enzyme
Mol. Mass.:40508.87
Organism:Homo sapiens (Human)
Description:P46663
Residue:353
BDBM50243065
NameBDBM50243065
Synonyms:CHEMBL470486 | N-[4-({[2-(2,4-Difluorobenzoyl)phenyl]amino}sulfonyl)phenyl]-acetamide
TypeSmall organic molecule
Emp. Form.C21H16F2N2O4S
Mol. Mass.430.425
SMILESCC(=O)Nc1ccc(cc1)S(=O)(=O)Nc1ccccc1C(=O)c1ccc(F)cc1F