Reaction Details
TargetSodium-dependent serotonin transporter
LigandBDBM50331515
Substrate/Competitorn/a
Meas. Tech.ChEMBL_535411 (CHEMBL984440)
Ki 0.08±n/a nM
Citation Strappaghetti, GMastrini, LLucacchini, AGiannaccini, GBetti, LFabbrini, L Synthesis and biological affinity of new imidazo- and indol-arylpiperazine derivatives: further validation of a pharmacophore model for alpha(1)-adrenoceptor antagonists. Bioorg Med Chem Lett18:5140-5 (2008) 
 
Sodium-dependent serotonin transporter
Name:Sodium-dependent serotonin transporter
Type:Multi-pass membrane protein
Mol. Mass.:70322.51
Organism:Homo sapiens (Human)
Description:P31645
Residue:630
BDBM50331515
NameBDBM50331515
Synonyms:CHEMBL1708 Paroxetine hydrochloride Paxil | Paxil cr
TypeSmall organic molecule
Emp. Form.C19H20FNO3
Mol. Mass.329.3654
SMILESFc1ccc(cc1)[C@@H]1CCNC[C@H]1COc1ccc2OCOc2c1