Reaction Details
TargetSodium-dependent noradrenaline transporter
LigandBDBM50124566
Substrate/Competitorn/a
Meas. Tech.ChEMBL_535516 (CHEMBL986142)
IC50 3±n/a nM
Citation McComas, CCVu, ATMahaney, PECohn, STFensome, AMarella, MANogle, LTrybulski, EJYe, FZhang, PAlfinito, PBray, JJohnston, GKoury, EDeecher, DC Synthesis and activity of 1-(3-amino-1-phenylpropyl)indolin-2-ones: a new class of selective norepinephrine reuptake inhibitors. Bioorg Med Chem Lett18:4929-31 (2008) 
 
Sodium-dependent noradrenaline transporter
Name:Sodium-dependent noradrenaline transporter
Type:Multi-pass membrane protein
Mol. Mass.:69337.72
Organism:Homo sapiens (Human)
Description:P23975
Residue:617
BDBM50124566
NameBDBM50124566
Synonyms:(R)-2-((R)-(2-ethoxyphenoxy)(phenyl)methyl)morpholine 2-((2-ethoxyphenoxy)(phenyl)methyl)morpholine 2-[2-ethoxyphenoxy(phenyl)methyl]-1,4-oxazinane REBOXETINE | rac-syn-2-((2-ethoxyphenoxy)(phenyl)methyl)morpholine
TypeSmall organic molecule
Emp. Form.C19H23NO3
Mol. Mass.313.3908
SMILESCCOc1ccccc1OC(C1CNCCO1)c1ccccc1