Reaction Details
TargetSodium-dependent serotonin transporter
LigandBDBM84745
Substrate/Competitorn/a
Meas. Tech.ChEMBL_535517 (CHEMBL986143)
IC50 3±n/a nM
Citation McComas, CCVu, ATMahaney, PECohn, STFensome, AMarella, MANogle, LTrybulski, EJYe, FZhang, PAlfinito, PBray, JJohnston, GKoury, EDeecher, DC Synthesis and activity of 1-(3-amino-1-phenylpropyl)indolin-2-ones: a new class of selective norepinephrine reuptake inhibitors. Bioorg Med Chem Lett18:4929-31 (2008) 
 
Sodium-dependent serotonin transporter
Name:Sodium-dependent serotonin transporter
Type:Multi-pass membrane protein
Mol. Mass.:70322.51
Organism:Homo sapiens (Human)
Description:P31645
Residue:630
BDBM84745
NameBDBM84745
Synonyms:CAS_136434-34-9 LY-248686 USRE49340, Rank 5
TypeSmall organic molecule
Emp. Form.C18H19NOS
Mol. Mass.297.415
SMILESCNCC[C@H](Oc1cccc2ccccc12)c1cccs1