Reaction Details
TargetSodium-dependent serotonin transporter
LigandBDBM22417
Substrate/Competitorn/a
Meas. Tech.ChEMBL_535517 (CHEMBL986143)
IC50 277±n/a nM
Citation McComas, CCVu, ATMahaney, PECohn, STFensome, AMarella, MANogle, LTrybulski, EJYe, FZhang, PAlfinito, PBray, JJohnston, GKoury, EDeecher, DC Synthesis and activity of 1-(3-amino-1-phenylpropyl)indolin-2-ones: a new class of selective norepinephrine reuptake inhibitors. Bioorg Med Chem Lett18:4929-31 (2008) 
 
Sodium-dependent serotonin transporter
Name:Sodium-dependent serotonin transporter
Type:Multi-pass membrane protein
Mol. Mass.:70322.51
Organism:Homo sapiens (Human)
Description:P31645
Residue:630
BDBM22417
NameBDBM22417
Synonyms:3-(2-methoxyphenoxy)-N-methyl-3-phenylpropan-1-amine LY 135252 LY135252 Nisoxetine US9944618, Compound ID No. 177 [3H]Nisoxetine
Typeradiolabeled ligand
Emp. Form.C17H21NO2
Mol. Mass.271.3541
SMILESCNCCC(Oc1ccccc1OC)c1ccccc1