Reaction Details
TargetSmall conductance calcium-activated potassium channel protein 1
LigandBDBM50263327
Substrate/Competitorn/a
Meas. Tech.ChEMBL_535548 (CHEMBL986174)
IC50 4±n/a nM
Citation Gentles, RGGrant-Young, KHu, SHuang, YPoss, MAAndres, CFiedler, TKnox, RLodge, NWeaver, CDHarden, DG Initial SAR studies on apamin-displacing 2-aminothiazole blockers of calcium-activated small conductance potassium channels. Bioorg Med Chem Lett18:5316-9 (2008) 
 
Small conductance calcium-activated potassium channel protein 1
Name:Small conductance calcium-activated potassium channel protein 1
Type:Protein
Mol. Mass.:60005.90
Organism:Homo sapiens (Human)
Description:Q92952
Residue:543
BDBM50263327
NameBDBM50263327
Synonyms:CHEMBL476339 | N-(4-methylpyridin-2-yl)-4-(pyridin-2-yl)thiazol-2-amine
TypeSmall organic molecule
Emp. Form.C14H12N4S
Mol. Mass.268.337
SMILESCc1ccnc(Nc2nc(cs2)-c2ccccn2)c1