Reaction Details
TargetAromatase
LigandBDBM19459
Substrate/Competitorn/a
Meas. Tech.ChEMBL_535644 (CHEMBL987972)
Ki 100000±n/a nM
Citation Paoletta, SSteventon, GBWildeboer, DEhrman, TMHylands, PJBarlow, DJ Screening of herbal constituents for aromatase inhibitory activity. Bioorg Med Chem16:8466-70 (2008) 
 
Aromatase
Name:Aromatase
Type:Enzyme
Mol. Mass.:57888.92
Organism:Homo sapiens (Human)
Description:P11511
Residue:503
BDBM19459
NameBDBM19459
Synonyms:5,7-dihydroxy-3-(4-hydroxyphenyl)-4H-chromen-4-one Genistein Genisteol US8552057, 2 | cid_5280961
TypePhytoestrogen
Emp. Form.C15H10O5
Mol. Mass.270.2369
SMILESOc1ccc(cc1)-c1coc2cc(O)cc(O)c2c1=O