Reaction Details
TargetAmyloid-beta precursor protein
LigandBDBM50263885
Substrate/Competitorn/a
Meas. Tech.ChEMBL_535894 (CHEMBL983535)
IC50 170±n/a nM
Citation Byun, JHKim, HKim, YMook-Jung, IKim, DJLee, WKYoo, KH Aminostyrylbenzofuran derivatives as potent inhibitors for Abeta fibril formation. Bioorg Med Chem Lett18:5591-3 (2008) 
 
Amyloid-beta precursor protein
Name:Amyloid-beta precursor protein
Type:Single-pass type I membrane protein
Mol. Mass.:86890.41
Organism:Homo sapiens (Human)
Description:P05067
Residue:770
BDBM50263885
NameBDBM50263885
Synonyms:4-(2-(5-iodobenzofuran-2-yl)vinyl)-N,N-dimethylbenzenamine | CHEMBL524114
TypeSmall organic molecule
Emp. Form.C18H16INO
Mol. Mass.389.2302
SMILESCN(C)c1ccc(\C=C\c2cc3cc(I)ccc3o2)cc1