Reaction Details
TargetTyrosine-protein kinase SYK
LigandBDBM50274713
Substrate/Competitorn/a
Meas. Tech.ChEMBL_537397 (CHEMBL992587)
IC50 92±n/a nM
Citation Hirabayashi, AMukaiyama, HKobayashi, HShiohara, HNakayama, SOzawa, MTsuji, EMiyazawa, KMisawa, KOhnota, HIsaji, M Structure-activity relationship studies of imidazo[1,2-c]pyrimidine derivatives as potent and orally effective Syk family kinases inhibitors. Bioorg Med Chem16:9247-60 (2008) 
 
Tyrosine-protein kinase SYK
Name:Tyrosine-protein kinase SYK
Type:Enzyme
Mol. Mass.:72079.99
Organism:Homo sapiens (Human)
Description:P43405
Residue:635
BDBM50274713
NameBDBM50274713
Synonyms:CHEMBL457519 | cis-5-(2-Aminocyclohexylamino)-7-(4-methoxyphenylamino)imidazo[1,2-c]pyrimidine-8-carboxamide
TypeSmall organic molecule
Emp. Form.C20H25N7O2
Mol. Mass.395.4582
SMILESCOc1ccc(Nc2nc(N[C@H]3CCCC[C@H]3N)n3ccnc3c2C(N)=O)cc1