Reaction Details
TargetTyrosine-protein kinase ZAP-70
LigandBDBM50249254
Substrate/Competitorn/a
Meas. Tech.ChEMBL_537398 (CHEMBL992588)
IC50 120±n/a nM
Citation Hirabayashi, AMukaiyama, HKobayashi, HShiohara, HNakayama, SOzawa, MTsuji, EMiyazawa, KMisawa, KOhnota, HIsaji, M Structure-activity relationship studies of imidazo[1,2-c]pyrimidine derivatives as potent and orally effective Syk family kinases inhibitors. Bioorg Med Chem16:9247-60 (2008) 
 
Tyrosine-protein kinase ZAP-70
Name:Tyrosine-protein kinase ZAP-70
Type:Enzyme
Mol. Mass.:69881.61
Organism:Homo sapiens (Human)
Description:ZAP-70 SH2 domain was expressed and purified from E. coli using O-phospho-L-tyrosine-agarose column.
Residue:619
BDBM50249254
NameBDBM50249254
Synonyms:5-((1S,2R)-2-aminocyclohexylamino)-7-(3,5-dimethoxyphenylamino)-[1,2,4]triazolo[4,3-c]pyrimidine-8-carboxamide CHEMBL475609 | cis-5-(2-Aminocyclohexylamino)-7-(3,5-dimethoxyphenylamino)-1,2,4-triazolo[4,3-c]pyrimidine-8-carboxyamide
TypeSmall organic molecule
Emp. Form.C20H26N8O3
Mol. Mass.426.4722
SMILESCOc1cc(Nc2nc(N[C@H]3CCCC[C@H]3N)n3cnnc3c2C(N)=O)cc(OC)c1