Reaction Details
TargetTyrosine-protein kinase ZAP-70
LigandBDBM50274673
Substrate/Competitorn/a
Meas. Tech.ChEMBL_537398 (CHEMBL992588)
IC50 230±n/a nM
Citation Hirabayashi, AMukaiyama, HKobayashi, HShiohara, HNakayama, SOzawa, MTsuji, EMiyazawa, KMisawa, KOhnota, HIsaji, M Structure-activity relationship studies of imidazo[1,2-c]pyrimidine derivatives as potent and orally effective Syk family kinases inhibitors. Bioorg Med Chem16:9247-60 (2008) 
 
Tyrosine-protein kinase ZAP-70
Name:Tyrosine-protein kinase ZAP-70
Type:Enzyme
Mol. Mass.:69881.61
Organism:Homo sapiens (Human)
Description:ZAP-70 SH2 domain was expressed and purified from E. coli using O-phospho-L-tyrosine-agarose column.
Residue:619
BDBM50274673
NameBDBM50274673
Synonyms:CHEMBL485204 | cis-5-(2-Aminocyclohexylamino)-7-(3,5-dimethoxylphenylamino)imidazo[1,2-c]pyrimidine-8-carboxamide
TypeSmall organic molecule
Emp. Form.C21H27N7O3
Mol. Mass.425.4842
SMILESCOc1cc(Nc2nc(N[C@H]3CCCC[C@H]3N)n3ccnc3c2C(N)=O)cc(OC)c1