Reaction Details
TargetKappa-type opioid receptor
LigandBDBM50274774
Substrate/Competitorn/a
Meas. Tech.ChEMBL_537686 (CHEMBL993480)
IC50 25±n/a nM
Citation Kawai, KHayakawa, JMiyamoto, TImamura, YYamane, SWakita, HFujii, HKawamura, KMatsuura, HIzumimoto, NKobayashi, REndo, TNagase, H Design, synthesis, and structure-activity relationship of novel opioid kappa-agonists. Bioorg Med Chem16:9188-201 (2008) 
 
Kappa-type opioid receptor
Name:Kappa-type opioid receptor
Type:Enzyme
Mol. Mass.:42656.78
Organism:Mus musculus (Mouse)
Description:P33534
Residue:380
BDBM50274774
NameBDBM50274774
Synonyms:CHEMBL456659 | N-[(5R,6R)-17-(Cyclopropylmethyl)-4,5-epoxy-3,14-dihydroxymorphinan-6-yl]-hexanamide
TypeSmall organic molecule
Emp. Form.C26H36N2O4
Mol. Mass.440.575
SMILESCCCCCC(=O)N[C@@H]1CC[C@@]2(O)[C@H]3Cc4ccc(O)c5O[C@@H]1[C@]2(CCN3CC1CC1)c45